Target
Type-1 angiotensin II receptor
Ligand
BDBM50049205
Substrate
Meas. Tech.
ChEMBL_36777 (CHEMBL883280)
IC50
250±n/a nM
Citation
 Wexler, RRGreenlee, WJIrvin, JDGoldberg, MRPrendergast, KSmith, RDTimmermans, PB Nonpeptide angiotensin II receptor antagonists: the next generation in antihypertensive therapy. J Med Chem 39:625-56 (1996)  
Target
Name:
Type-1 angiotensin II receptor
Synonyms:
AGTR1 Angiotensin II type 1a (AT-1a) receptor
Type:
PROTEIN
Mol. Mass.:
41107.81
Organism:
Bos taurus
Description:
ChEMBL_36779
Residue:
359
  
Inhibitor
Name:
BDBM50049205
Synonyms:
CHEMBL48602 [4-Ethyl-4-methyl-6-oxo-1-[2'-(1H-tetrazol-5-yl)-biphenyl-4-ylmethyl]-piperidin-(2E)-ylidene]-acetic acid ethyl ester
Type:
Small organic molecule
Emp. Form.:
C26H29N5O3
Mol. Mass.:
459.5402
SMILES:
CCOC(=O)\C=C1/CC(C)(CC)CC(=O)N1Cc1ccc(cc1)-c1ccccc1-c1nnn[nH]1
: