Target
Type-1 angiotensin II receptor
Ligand
BDBM50049210
Substrate
Meas. Tech.
ChEMBL_35266 (CHEMBL648572)
Ki
20±n/a nM
Citation
 Wexler, RRGreenlee, WJIrvin, JDGoldberg, MRPrendergast, KSmith, RDTimmermans, PB Nonpeptide angiotensin II receptor antagonists: the next generation in antihypertensive therapy. J Med Chem 39:625-56 (1996)  
Target
Name:
Type-1 angiotensin II receptor
Synonyms:
AGTR1 AGTR1B AT1 AT1BR AT2R1B Angiotensin II receptor Type-1 angiotensin II receptor (AT1)
Type:
Protein
Mol. Mass.:
41080.75
Organism:
Homo sapiens (Human)
Description:
P30556
Residue:
359
  
Inhibitor
Name:
BDBM50049210
Synonyms:
CHEMBL348126 | N-{4-[2-Butyl-6-(3-methyl-1-pentyl-ureido)-benzoimidazol-1-ylmethyl]-phenyl}-3,6-dichloro-phthalamic acid
Type:
Small organic molecule
Emp. Form.:
C33H37Cl2N5O4
Mol. Mass.:
638.584
SMILES:
CCCCCN(C(=O)NC)c1ccc2nc(CCCC)n(Cc3ccc(NC(=O)c4c(Cl)ccc(Cl)c4C(O)=O)cc3)c2c1
: