Target
Nitric oxide synthase, endothelial
Ligand
BDBM50049252
Substrate
Meas. Tech.
ChEMBL_65298 (CHEMBL676786)
IC50
500±n/a nM
Citation
 Moore, WMWebber, RKFok, KFJerome, GMConnor, JRManning, PTWyatt, PSMisko, TPTjoeng, FSCurrie, MG 2-Iminopiperidine and other 2-iminoazaheterocycles as potent inhibitors of human nitric oxide synthase isoforms. J Med Chem 39:669-72 (1996)  
Target
Name:
Nitric oxide synthase, endothelial
Synonyms:
Constitutive NOS Endothelial NOS NOS type III NOS3_HUMAN Nitric oxide synthase (inducible and endothelial) Nitric-oxide synthase (endothelial and brain) eNOS
Type:
Enzyme Catalytic Domain
Mol. Mass.:
133297.84
Organism:
Homo sapiens (Human)
Description:
P29474
Residue:
1203
  
Inhibitor
Name:
BDBM50049252
Synonyms:
2-Amino-5-(N-nitro-guanidino)-pentanoic acid | CHEMBL353794
Type:
Small organic molecule
Emp. Form.:
C6H13N5O4
Mol. Mass.:
219.1985
SMILES:
N[C@@H](CCCN(C(N)=N)[N+]([O-])=O)C(O)=O
: