Target
D(1A) dopamine receptor
Ligand
BDBM50004921
Substrate
Meas. Tech.
ChEMBL_59146 (CHEMBL671028)
Kd
384±n/a nM
Citation
 Brusniak, MYPearlman, RSNeve, KAWilcox, RE Comparative molecular field analysis-based prediction of drug affinities at recombinant D1A dopamine receptors. J Med Chem 39:850-9 (1996)  
Target
Name:
D(1A) dopamine receptor
Synonyms:
DA D1 receptor DRD1 Dopamine D1 receptor Dopamine D1A
Type:
Enzyme
Mol. Mass.:
49303.43
Organism:
Homo sapiens (Human)
Description:
P21728
Residue:
446
  
Inhibitor
Name:
BDBM50004921
Synonyms:
(R)-3-Allyl-6-bromo-7,8-dihydroxy-1-phenyl-2,3,4,5-tetrahydro-1H-benzo[d]azepinium CHEMBL34095 | R-(+)6-Br-APD3-Allyl-6-bromo-1-phenyl-2,3,4,5-tetrahydro-1H-benzo[d]azepine-7,8-diol
Type:
Small organic molecule
Emp. Form.:
C19H20BrNO2
Mol. Mass.:
374.272
SMILES:
Oc1cc2[C@H](CN(CC=C)CCc2c(Br)c1O)c1ccccc1
: