Target
Alpha-2C adrenergic receptor
Ligand
BDBM50016897
Substrate
Meas. Tech.
ChEMBL_33525 (CHEMBL648617)
Ki
30±n/a nM
Citation
 Munk, SALai, RKBurke, JEArasasingham, PNKharlamb, ABManlapaz, CAPadillo, EUWijono, MKHasson, DWWheeler, LAGarst, ME Synthesis and pharmacologic evaluation of 2-endo-amino-3-exo-isopropylbicyclo[2.2.1]heptane: a potent imidazoline1 receptor specific agent. J Med Chem 39:1193-5 (1996)  
Target
Name:
Alpha-2C adrenergic receptor
Synonyms:
ADA2C_HUMAN ADRA2L2 Adrenergic alpha2C Adrenergic receptor alpha Alpha-2 adrenergic receptor subtype C4 Alpha-2C adrenoreceptor | adrenergic, alpha-2C-, receptor [Homo sapiens]
Type:
Enzyme
Mol. Mass.:
49552.32
Organism:
Homo sapiens (Human)
Description:
P18825
Residue:
462
  
Inhibitor
Name:
BDBM50016897
Synonyms:
2-(2,6-dichloroanilino)-1,3-diazacyclopentene-(2) CLONIDINE clonidine (amino form)
Type:
Small organic molecule
Emp. Form.:
C9H9Cl2N3
Mol. Mass.:
230.094
SMILES:
Clc1cccc(Cl)c1\[#7]=[#6]-1\[#7]-[#6]-[#6]-[#7]-1
: