Target
Neprilysin
Ligand
BDBM50050127
Substrate
Meas. Tech.
ChEMBL_144463 (CHEMBL755110)
IC50
1.4±n/a nM
Citation
 Coric, PTurcaud, SMeudal, HRoques, BPFournie-Zaluski, MC Optimal recognition of neutral endopeptidase and angiotensin-converting enzyme active sites by mercaptoacyldipeptides as a means to design potent dual inhibitors. J Med Chem 39:1210-9 (1996)  
Target
Name:
Neprilysin
Synonyms:
Atriopeptidase CD_antigen=CD10 MME NEP_RABIT Neutral endopeptidase 24.11
Type:
Enzyme
Mol. Mass.:
85570.75
Organism:
Oryctolagus cuniculus (rabbit)
Description:
NEP was purified to homogeneity from rabbit kidney.
Residue:
750
  
Inhibitor
Name:
BDBM50050127
Synonyms:
(S)-3-(4-Hydroxy-phenyl)-2-[(2S,3R)-2-((S)-2-mercapto-3-methyl-butyrylamino)-3-methyl-pentanoylamino]-propionic acid | CHEMBL20341
Type:
Small organic molecule
Emp. Form.:
C20H30N2O5S
Mol. Mass.:
410.528
SMILES:
CC[C@@H](C)[C@H](NC(=O)[C@@H](S)C(C)C)C(=O)N[C@@H](Cc1ccc(O)cc1)C(O)=O
: