Target
Angiotensin-converting enzyme
Ligand
BDBM50050125
Substrate
Meas. Tech.
ChEMBL_35230 (CHEMBL647399)
IC50
1.1±n/a nM
Citation
 Coric, PTurcaud, SMeudal, HRoques, BPFournie-Zaluski, MC Optimal recognition of neutral endopeptidase and angiotensin-converting enzyme active sites by mercaptoacyldipeptides as a means to design potent dual inhibitors. J Med Chem 39:1210-9 (1996)  
Target
Name:
Angiotensin-converting enzyme
Synonyms:
ACE_RAT Angiotensin-converting enzyme | Dcp1
Type:
PROTEIN
Mol. Mass.:
150907.81
Organism:
Rattus norvegicus
Description:
ChEMBL_35219
Residue:
1313
  
Inhibitor
Name:
BDBM50050125
Synonyms:
1-[(S)-2-((S)-2-Mercapto-3-phenyl-propionylamino)-3-phenyl-propionyl]-pyrrolidine-2-carboxylic acid | CHEMBL283741
Type:
Small organic molecule
Emp. Form.:
C23H26N2O4S
Mol. Mass.:
426.529
SMILES:
OC(=O)C1CCCN1C(=O)[C@H](Cc1ccccc1)NC(=O)[C@@H](S)Cc1ccccc1
: