Target
Adenosine receptor A1
Ligand
BDBM50454491
Substrate
Meas. Tech.
ChEMBL_29171 (CHEMBL637902)
Ki
1260±n/a nM
Citation
 Roelen, HVeldman, NSpek, ALvon Frijtag Drabbe Künzel, JMathôt, RAIJzerman, AP N6,C8-distributed adenosine derivatives as partial agonists for adenosine A1 receptors. J Med Chem 39:1463-71 (1996)  
Target
Name:
Adenosine receptor A1
Synonyms:
AA1R_RAT ADENOSINE A1 high Adenosine A1 receptor (A1) Adenosine receptors A1 | Adora1
Type:
Protein
Mol. Mass.:
36704.13
Organism:
Rattus norvegicus (rat)
Description:
Residue:
326
  
Inhibitor
Name:
BDBM50454491
Synonyms:
CHEMBL2113442
Type:
Small organic molecule
Emp. Form.:
C17H26N6O4
Mol. Mass.:
378.4261
SMILES:
CCNc1ncnc2n([C@@H]3O[C@H](CO)[C@@H](O)[C@H]3O)c(NC3CCCC3)nc12
: