Target
Thyrotropin-releasing hormone receptor
Ligand
BDBM50072394
Substrate
Meas. Tech.
ChEMBL_207855 (CHEMBL810063)
Ki
10±n/a nM
Citation
 Rutledge, LDPerlman, JHGershengorn, MCMarshall, GRMoeller, KD Conformationally restricted TRH analogs: a probe for the pyroglutamate region. J Med Chem 39:1571-4 (1996)  
Target
Name:
Thyrotropin-releasing hormone receptor
Synonyms:
TRH-R Thyroliberin receptor thyrotropin-releasing hormone R1
Type:
Enzyme Catalytic Domain
Mol. Mass.:
44568.52
Organism:
MOUSE
Description:
thyrotropin-releasing hormone R1 TRHR MOUSE::P21761
Residue:
393
  
Inhibitor
Name:
BDBM50072394
Synonyms:
1-[3-(1H-4-imidazolyl)-2-(5-oxotetrahydro-1H-2-pyrrolylcarboxamido)propanoyl]tetrahydro-1H-2-pyrrolecarboxamide ABBOTT-38579 | PROTIRELIN
Type:
Small organic molecule
Emp. Form.:
C16H22N6O4
Mol. Mass.:
362.3837
SMILES:
NC(=O)[C@@H]1CCCN1C(=O)[C@H](Cc1cnc[nH]1)NC(=O)[C@@H]1CCC(=O)N1
: