Target
Kappa-type opioid receptor
Ligand
BDBM50369225
Substrate
Meas. Tech.
ChEMBL_145932 (CHEMBL752598)
IC50
0.370000±n/a nM
Citation
 Chang, ACChao, CCTakemori, AEGekker, GHu, SPeterson, PKPortoghese, PS Arylacetamide-derived fluorescent probes: synthesis, biological evaluation, and direct fluorescent labeling of kappa opioid receptors in mouse microglial cells. J Med Chem 39:1729-35 (1996)  
Target
Name:
Kappa-type opioid receptor
Synonyms:
Kappa Opioid Receptor OPRK1 Opiate Kappa 1 | mu/kappa opioid receptor
Type:
G Protein-Coupled Receptor (GPCR)
Mol. Mass.:
42744.99
Organism:
Cavia porcellus (domestic guinea pig)
Description:
P41144
Residue:
380
  
Inhibitor
Name:
BDBM50369225
Synonyms:
CHEMBL1907786
Type:
Small organic molecule
Emp. Form.:
C42H36Cl2N4O6S
Mol. Mass.:
795.729
SMILES:
CN([C@H](CN1CCCC1)c1cccc(NC(=S)Nc2ccc(c(c2)C(O)=O)-c2c3ccc(O)cc3oc3cc(=O)ccc23)c1)C(=O)Cc1ccc(Cl)c(Cl)c1
: