Target
Kappa-type opioid receptor
Ligand
BDBM50050752
Substrate
Meas. Tech.
ChEMBL_145552 (CHEMBL751016)
IC50
170±n/a nM
Citation
 Chang, ACChao, CCTakemori, AEGekker, GHu, SPeterson, PKPortoghese, PS Arylacetamide-derived fluorescent probes: synthesis, biological evaluation, and direct fluorescent labeling of kappa opioid receptors in mouse microglial cells. J Med Chem 39:1729-35 (1996)  
Target
Name:
Kappa-type opioid receptor
Synonyms:
KOR-1 OPIATE Kappa Oprk1
Type:
Enzyme
Mol. Mass.:
42656.78
Organism:
Mus musculus (Mouse)
Description:
P33534
Residue:
380
  
Inhibitor
Name:
BDBM50050752
Synonyms:
5-{3-[({[4-(1-{[2-(3,4-Dichloro-phenyl)-acetyl]-methyl-amino}-2-pyrrolidin-1-yl-ethyl)-phenylcarbamoyl]-methyl}-carbamoyl)-methyl]-thioureido}-2-(6-hydroxy-3-oxo-3H-xanthen-9-yl)-benzoic acid; compound with triethyl-amine | CHEMBL47318
Type:
Small organic molecule
Emp. Form.:
C46H42Cl2N6O8S
Mol. Mass.:
909.832
SMILES:
[#6]-[#7](-[#6](-[#6]-[#7]-1-[#6]-[#6]-[#6]-[#6]-1)-c1ccc(-[#7]-[#6](=O)-[#6]-[#7]-[#6](=O)-[#6]-[#7]-[#6](=S)-[#7]=[#6]-2-[#6]=[#6]\[#6](-[#6](=[#6]-2)-[#6](-[#8])=O)=[#6]-2\c3ccc(-[#8])cc3-[#8]-c3cc(-[#8])ccc-23)cc1)-[#6](=O)-[#6]-c1ccc(Cl)c(Cl)c1
: