Target
Progesterone receptor
Ligand
BDBM50049496
Substrate
Meas. Tech.
ChEMBL_159855 (CHEMBL765832)
EC50
2117±n/a nM
Citation
 Hamann, LGFarmer, LJJohnson, MGBender, SLMais, DEWang, MWCrombie, DGoldman, MEJones, TK Synthesis and biological activity of novel nonsteroidal progesterone receptor antagonists based on cyclocymopol monomethyl ether. J Med Chem 39:1778-89 (1996)  
Target
Name:
Progesterone receptor
Synonyms:
NR3C3 PGR PRGR_HUMAN | progesterone
Type:
Protein
Mol. Mass.:
98979.52
Organism:
Homo sapiens (Human)
Description:
P06401
Residue:
933
  
Inhibitor
Name:
BDBM50049496
Synonyms:
Acetic acid 5-bromo-4-methoxy-2-(5,5,7-trimethyl-spiro[2.5]oct-7-en-4-ylmethyl)-phenyl ester | CHEMBL50849
Type:
Small organic molecule
Emp. Form.:
C21H27BrO3
Mol. Mass.:
407.341
SMILES:
COc1cc(CC2C3(CC3)C=C(C)CC2(C)C)c(OC(C)=O)cc1Br
: