Target
Androgen receptor
Ligand
BDBM50049513
Substrate
Meas. Tech.
ChEMBL_36141 (CHEMBL648329)
Ki
1644±n/a nM
Citation
 Hamann, LGFarmer, LJJohnson, MGBender, SLMais, DEWang, MWCrombie, DGoldman, MEJones, TK Synthesis and biological activity of novel nonsteroidal progesterone receptor antagonists based on cyclocymopol monomethyl ether. J Med Chem 39:1778-89 (1996)  
Target
Name:
Androgen receptor
Synonyms:
ANDR_HUMAN Androgen Receptor Androgen receptor/Baculoviral IAP repeat-containing protein 2 Dihydrotestosterone receptor Nuclear receptor subfamily 3 group C member 4
Type:
Receptor
Mol. Mass.:
99185.27
Organism:
Homo sapiens (Human)
Description:
CHO cells were stably transfected with human AR gene.
Residue:
920
  
Inhibitor
Name:
BDBM50049513
Synonyms:
5-Bromo-4-methoxy-2-((1R,2S)-2-methyl-6-methylene-cyclohexylmethyl)-phenol | CHEMBL299778
Type:
Small organic molecule
Emp. Form.:
C16H21BrO2
Mol. Mass.:
325.241
SMILES:
COc1cc(C[C@@H]2[C@@H](C)CCCC2=C)c(O)cc1Br
: