Target
D(1A) dopamine receptor
Ligand
BDBM50057856
Substrate
Meas. Tech.
ChEMBL_59009 (CHEMBL668873)
Ki
125±n/a nM
Citation
 Michaelides, MRHong, YDiDomenico, SBayburt, EKAsin, KEBritton, DRLin, CWShiosaki, K Substituted hexahydrobenzo[f]thieno[c]quinolines as dopamine D1-selective agonists: synthesis and biological evaluation in vitro and in vivo. J Med Chem 40:1585-99 (1997)  
Target
Name:
D(1A) dopamine receptor
Synonyms:
DOPAMINE D1 Dopamine D1 high Dopamine receptor Dopamine1-like Drd1a
Type:
Enzyme Catalytic Domain
Mol. Mass.:
49429.75
Organism:
RAT
Description:
P18901
Residue:
446
  
Inhibitor
Name:
BDBM50057856
Synonyms:
(5aR,11bS)-3-Propyl-4,5,5a,6,7,11b-hexahydro-2-thia-5-aza-cyclopenta[c]phenanthrene-9,10-diol; TFA | CHEMBL41238
Type:
Small organic molecule
Emp. Form.:
C18H21NO2S
Mol. Mass.:
315.43
SMILES:
CCCc1scc2[C@H]3[C@@H](CCc4cc(O)c(O)cc34)NCc12
: