Target
Prothrombin
Ligand
BDBM50369253
Substrate
Meas. Tech.
ChEMBL_207988 (CHEMBL816071)
IC50
110±n/a nM
Citation
 Petitou, MDuchaussoy, PJaurand, GGourvenec, FLederman, IStrassel, JMBârzu, TCrépon, BHérault, JPLormeau, JCBernat, AHerbert, JM Synthesis and pharmacological properties of a close analogue of an antithrombotic pentasaccharide (SR 90107A/ORG 31540). J Med Chem 40:1600-7 (1997)  
Target
Name:
Prothrombin
Synonyms:
Activation peptide fragment 1 Coagulation factor II Prothrombin precursor Thrombin heavy chain | Thrombin light chain
Type:
Protein
Mol. Mass.:
70029.57
Organism:
Homo sapiens (Human)
Description:
P00734
Residue:
622
  
Inhibitor
Name:
BDBM50369253
Synonyms:
CHEMBL1909451
Type:
Small organic molecule
Emp. Form.:
C37H54N2O50S8
Mol. Mass.:
1583.334
SMILES:
CO[C@@H]1O[C@H](COS([O-])(=O)=O)[C@@H](O[C@H]2O[C@H]([C@H](O[C@@H]3O[C@H](COS([O-])(=O)=O)[C@@H](O[C@H]4O[C@@H]([C@@H](O[C@@H]5O[C@@H](COS([O-])(=O)=O)[C@H](OC)[C@@H](OC)[C@@H]5NS([O-])(=O)=O)[C@@H](OC)[C@@H]4OC)C([O-])=O)[C@@H](OS([O-])(=O)=O)[C@@H]3OS([O-])(=O)=O)[C@@H](OC)[C@@H]2OS([O-])(=O)=O)C([O-])=O)[C@H](OC)[C@H]1NS([O-])(=O)=O
: