Target
Nitric oxide synthase, brain
Ligand
BDBM50058449
Substrate
Meas. Tech.
ChEMBL_143376 (CHEMBL880847)
Ki
1600±n/a nM
Citation
 Shearer, BGLee, SOplinger, JAFrick, LWGarvey, EPFurfine, ES Substituted N-phenylisothioureas: potent inhibitors of human nitric oxide synthase with neuronal isoform selectivity. J Med Chem 40:1901-5 (1997)  
Target
Name:
Nitric oxide synthase, brain
Synonyms:
Constitutive NOS NC-NOS NOS type I nNOS NOS1_HUMAN Neuronal nitric oxide synthase Nitric oxide synthase, neuronal (nNOS) bNOS | nNOS
Type:
Homodimer
Mol. Mass.:
160985.98
Organism:
Homo sapiens (Human)
Description:
P29475
Residue:
1434
  
Inhibitor
Name:
BDBM50058449
Synonyms:
4-(2-Ethyl-isothioureido)-benzoic acid ethyl ester; hydriodide CHEMBL545670
Type:
Small organic molecule
Emp. Form.:
C12H16N2O2S
Mol. Mass.:
252.333
SMILES:
CCOC(=O)c1ccc(cc1)N=C(N)SCC
: