Target
Nitric oxide synthase, brain
Ligand
BDBM50058453
Substrate
Meas. Tech.
ChEMBL_143376 (CHEMBL880847)
Ki
700±n/a nM
Citation
 Shearer, BGLee, SOplinger, JAFrick, LWGarvey, EPFurfine, ES Substituted N-phenylisothioureas: potent inhibitors of human nitric oxide synthase with neuronal isoform selectivity. J Med Chem 40:1901-5 (1997)  
Target
Name:
Nitric oxide synthase, brain
Synonyms:
Constitutive NOS NC-NOS NOS type I nNOS NOS1_HUMAN Neuronal nitric oxide synthase Nitric oxide synthase, neuronal (nNOS) bNOS | nNOS
Type:
Homodimer
Mol. Mass.:
160985.98
Organism:
Homo sapiens (Human)
Description:
P29475
Residue:
1434
  
Inhibitor
Name:
BDBM50058453
Synonyms:
2-Ethyl-1-(4-trifluoromethoxy-phenyl)-isothiourea; hydrochloride CHEMBL554651
Type:
Small organic molecule
Emp. Form.:
C10H11F3N2OS
Mol. Mass.:
264.267
SMILES:
CCSC(N)=Nc1ccc(OC(F)(F)F)cc1
: