Target
Nitric oxide synthase, inducible
Ligand
BDBM50058454
Substrate
Meas. Tech.
ChEMBL_89177 (CHEMBL700496)
Ki
54000±n/a nM
Citation
 Shearer, BGLee, SOplinger, JAFrick, LWGarvey, EPFurfine, ES Substituted N-phenylisothioureas: potent inhibitors of human nitric oxide synthase with neuronal isoform selectivity. J Med Chem 40:1901-5 (1997)  
Target
Name:
Nitric oxide synthase, inducible
Synonyms:
HEP-NOS Inducible NO synthase NOS type II NOS2A Nitric oxide synthase, inducible (iNOS) | iNOS
Type:
Homodimer
Mol. Mass.:
131141.95
Organism:
Homo sapiens (Human)
Description:
P35228
Residue:
1153
  
Inhibitor
Name:
BDBM50058454
Synonyms:
2-Ethyl-1-(4-nitro-phenyl)-isothiourea; hydriodide | CHEMBL543092
Type:
Small organic molecule
Emp. Form.:
C9H11N3O2S
Mol. Mass.:
225.268
SMILES:
CCS\C([NH-])=[NH+]\c1ccc(cc1)[N+]([O-])=O
: