Target
Melanocyte-stimulating hormone receptor
Ligand
BDBM50454568
Substrate
Meas. Tech.
ChEMBL_105830 (CHEMBL716490)
EC50
0.190000±n/a nM
Citation
 Haskell-Luevano, CHendrata, SNorth, CSawyer, TKHadley, MEHruby, VJDickinson, CGantz, I Discovery of prototype peptidomimetic agonists at the human melanocortin receptors MC1R and MC4R. J Med Chem 40:2133-9 (1997)  
Target
Name:
Melanocyte-stimulating hormone receptor
Synonyms:
MC1-R MSH-R MSHR_HUMAN Melanocortin receptor (M1 and M4) Melanocortin receptor 1 (MC1-R) | Melanocortin receptor 1 (MC1R)
Type:
Enzyme
Mol. Mass.:
34717.23
Organism:
Homo sapiens (Human)
Description:
Q01726
Residue:
317
  
Inhibitor
Name:
BDBM50454568
Synonyms:
CHEMBL263948
Type:
Small organic molecule
Emp. Form.:
C77H109N21O19S
Mol. Mass.:
1664.884
SMILES:
CSCC[C@H](NC(=O)[C@H](CO)NC(=O)[C@H](Cc1ccc(O)cc1)NC(=O)[C@H](CO)NC(C)=O)C(=O)N[C@@H](CCC(O)=O)C(=O)N[C@@H](Cc1c[nH]cn1)C(=O)N[C@H](Cc1ccccc1)C(=O)N[C@@H](CCCN=C(N)N)C(=O)N[C@@H](Cc1c[nH]c2ccccc12)C(=O)NCC(=O)N[C@@H](CCCCN)C(=O)N1CCC[C@H]1C(=O)N[C@@H](C(C)C)C(N)=O
: