Target
Adenosine receptor A2a
Ligand
BDBM50452520
Substrate
Meas. Tech.
ChEMBL_31367 (CHEMBL644659)
Ki
19±n/a nM
Citation
 Jiang, QLee, BXGlashofer, Mvan Rhee, AMJacobson, KA Mutagenesis reveals structure-activity parallels between human A2A adenosine receptors and biogenic amine G protein-coupled receptors. J Med Chem 40:2588-95 (1997)  
Target
Name:
Adenosine receptor A2a
Synonyms:
A2A adenosine receptor (hA2A) ADENOSINE A2 ADORA2 Adenosine A2A receptor (A2AAR)
Type:
G Protein-Coupled Receptor (GPCR)
Mol. Mass.:
44716.46
Organism:
Homo sapiens (Human)
Description:
P29274
Residue:
412
  
Inhibitor
Name:
BDBM50452520
Synonyms:
CHEMBL2094089 | N6-[2-(3,5-dimethoxyphenyl)-2-(2-methylpheny1)ethyl]adenosine (3, DPMA)
Type:
Small organic molecule
Emp. Form.:
C27H31N5O6
Mol. Mass.:
521.5649
SMILES:
COc1cc(OC)cc(c1)C(CNc1ncnc2n(cnc12)[C@@H]1O[C@H](CO)[C@@H](O)[C@H]1O)c1ccccc1C
: