Target
Delta-type opioid receptor
Ligand
BDBM50059838
Substrate
Meas. Tech.
ChEMBL_147182 (CHEMBL754481)
Ki
1760±n/a nM
Citation
 Tomatis, RMarastoni, MBalboni, GGuerrini, RCapasso, ASorrentino, LSantagada, VCaliendo, GLazarus, LHSalvadori, S Synthesis and pharmacological activity of deltorphin and dermorphin-related glycopeptides. J Med Chem 40:2948-52 (1997)  
Target
Name:
Delta-type opioid receptor
Synonyms:
Cytochrome P450 3A4 Delta opioid receptor Delta-type opioid receptor (DOR) OPRD_RAT Opioid receptor Opioid receptors; mu & delta Ror-a | Voltage-gated potassium channel
Type:
G Protein-Coupled Receptor (GPCR)
Mol. Mass.:
40465.04
Organism:
Rattus norvegicus (rat)
Description:
Competition binding assays were using CHO-K1 cell membranes expressing the opioid receptor.
Residue:
372
  
Inhibitor
Name:
BDBM50059838
Synonyms:
CHEMBL2370329 | Tyr-D-Ala-Phe-Thr(-D-Glc)-Tyr-Pro-Ser-NH2
Type:
Small organic molecule
Emp. Form.:
C48H64N8O16
Mol. Mass.:
1009.0658
SMILES:
C[C@@H](O[C@H]1O[C@H](CO)[C@@H](O)[C@H](O)[C@H]1O)[C@H](NC(=O)[C@H](Cc1ccccc1)NC(=O)[C@@H](C)NC(=O)[C@@H](N)Cc1ccc(O)cc1)C(=O)N[C@@H](Cc1ccc(O)cc1)C(=O)N1CCC[C@H]1C(=O)N[C@@H](CO)C(N)=O
: