Target
Coagulation factor X
Ligand
BDBM50060037
Substrate
Meas. Tech.
ChEMBL_48481 (CHEMBL662059)
Ki
24000±n/a nM
Citation
 Stürzebecher, JPrasa, DHauptmann, JVieweg, HWikström, P Synthesis and structure-activity relationships of potent thrombin inhibitors: piperazides of 3-amidinophenylalanine. J Med Chem 40:3091-9 (1997)  
Target
Name:
Coagulation factor X
Synonyms:
Coagulation factor X FA10_BOVIN | Factor Xa (fXa)
Type:
PROTEIN
Mol. Mass.:
54498.45
Organism:
Bos taurus
Description:
ChEMBL_1364435
Residue:
492
  
Inhibitor
Name:
BDBM50060037
Synonyms:
3-[3-(4-Ethanesulfonyl-piperazin-1-yl)-2-(naphthalene-2-sulfonylamino)-3-oxo-propyl]-benzamidine | CHEMBL323304
Type:
Small organic molecule
Emp. Form.:
C26H31N5O5S2
Mol. Mass.:
557.685
SMILES:
CCS(=O)(=O)N1CCN(CC1)C(=O)C(Cc1cccc(c1)C(N)=N)NS(=O)(=O)c1ccc2ccccc2c1
: