Target
Anionic trypsin
Ligand
BDBM50060022
Substrate
Meas. Tech.
ChEMBL_212519 (CHEMBL817584)
Ki
28±n/a nM
Citation
 Stürzebecher, JPrasa, DHauptmann, JVieweg, HWikström, P Synthesis and structure-activity relationships of potent thrombin inhibitors: piperazides of 3-amidinophenylalanine. J Med Chem 40:3091-9 (1997)  
Target
Name:
Anionic trypsin
Synonyms:
Anionic trypsin Trypsin II
Type:
PROTEIN
Mol. Mass.:
26281.39
Organism:
Bos taurus
Description:
ChEMBL_212177
Residue:
247
  
Inhibitor
Name:
BDBM50060022
Synonyms:
4-[3-(3-Carbamimidoyl-phenyl)-2-(naphthalene-2-sulfonylamino)-propionyl]-piperazine-1-carboxylic acid phenyl ester | CHEMBL322622
Type:
Small organic molecule
Emp. Form.:
C31H31N5O5S
Mol. Mass.:
585.673
SMILES:
NC(=N)c1cccc(CC(NS(=O)(=O)c2ccc3ccccc3c2)C(=O)N2CCN(CC2)C(=O)Oc2ccccc2)c1
: