Target
Anionic trypsin
Ligand
BDBM50060055
Substrate
Meas. Tech.
ChEMBL_212519 (CHEMBL817584)
Ki
20±n/a nM
Citation
 Stürzebecher, JPrasa, DHauptmann, JVieweg, HWikström, P Synthesis and structure-activity relationships of potent thrombin inhibitors: piperazides of 3-amidinophenylalanine. J Med Chem 40:3091-9 (1997)  
Target
Name:
Anionic trypsin
Synonyms:
Anionic trypsin Trypsin II
Type:
PROTEIN
Mol. Mass.:
26281.39
Organism:
Bos taurus
Description:
ChEMBL_212177
Residue:
247
  
Inhibitor
Name:
BDBM50060055
Synonyms:
4-[3-(3-Carbamimidoyl-phenyl)-2-(naphthalene-2-sulfonylamino)-propionyl]-piperazine-1-carboxylic acid methyl ester | CHEMBL320393
Type:
Small organic molecule
Emp. Form.:
C26H29N5O5S
Mol. Mass.:
523.604
SMILES:
COC(=O)N1CCN(CC1)C(=O)C(Cc1cccc(c1)C(N)=N)NS(=O)(=O)c1ccc2ccccc2c1
: