Target
Prothrombin
Ligand
BDBM50060057
Substrate
Meas. Tech.
ChEMBL_210595 (CHEMBL816562)
Ki
24±n/a nM
Citation
 Stürzebecher, JPrasa, DHauptmann, JVieweg, HWikström, P Synthesis and structure-activity relationships of potent thrombin inhibitors: piperazides of 3-amidinophenylalanine. J Med Chem 40:3091-9 (1997)  
Target
Name:
Prothrombin
Synonyms:
Activation peptide fragment 1 Coagulation factor II Prothrombin Thrombin Thrombin light chain
Type:
Enzyme
Mol. Mass.:
70502.73
Organism:
Bos taurus (Bovine)
Description:
P00735
Residue:
625
  
Inhibitor
Name:
BDBM50060057
Synonyms:
3-{2-(Naphthalene-2-sulfonylamino)-3-[4-(naphthalene-2-sulfonyl)-piperazin-1-yl]-3-oxo-propyl}-benzamidine | CHEMBL320937
Type:
Small organic molecule
Emp. Form.:
C34H33N5O5S2
Mol. Mass.:
655.786
SMILES:
NC(=N)c1cccc(CC(NS(=O)(=O)c2ccc3ccccc3c2)C(=O)N2CCN(CC2)S(=O)(=O)c2ccc3ccccc3c2)c1
: