Target
Anionic trypsin
Ligand
BDBM50060026
Substrate
Meas. Tech.
ChEMBL_212519 (CHEMBL817584)
Ki
49±n/a nM
Citation
 Stürzebecher, JPrasa, DHauptmann, JVieweg, HWikström, P Synthesis and structure-activity relationships of potent thrombin inhibitors: piperazides of 3-amidinophenylalanine. J Med Chem 40:3091-9 (1997)  
Target
Name:
Anionic trypsin
Synonyms:
Anionic trypsin Trypsin II
Type:
PROTEIN
Mol. Mass.:
26281.39
Organism:
Bos taurus
Description:
ChEMBL_212177
Residue:
247
  
Inhibitor
Name:
BDBM50060026
Synonyms:
3-[3-(4-Butyryl-piperazin-1-yl)-2-(naphthalene-2-sulfonylamino)-3-oxo-propyl]-benzamidine | CHEMBL450936
Type:
Small organic molecule
Emp. Form.:
C28H33N5O4S
Mol. Mass.:
535.658
SMILES:
CCCC(=O)N1CCN(CC1)C(=O)C(Cc1cccc(c1)C(N)=N)NS(=O)(=O)c1ccc2ccccc2c1
: