Target
Prothrombin
Ligand
BDBM50060046
Substrate
Meas. Tech.
ChEMBL_210595 (CHEMBL816562)
Ki
12±n/a nM
Citation
 Stürzebecher, JPrasa, DHauptmann, JVieweg, HWikström, P Synthesis and structure-activity relationships of potent thrombin inhibitors: piperazides of 3-amidinophenylalanine. J Med Chem 40:3091-9 (1997)  
Target
Name:
Prothrombin
Synonyms:
Activation peptide fragment 1 Coagulation factor II Prothrombin Thrombin Thrombin light chain
Type:
Enzyme
Mol. Mass.:
70502.73
Organism:
Bos taurus (Bovine)
Description:
P00735
Residue:
625
  
Inhibitor
Name:
BDBM50060046
Synonyms:
3-[(R)-2-[2-(7,7-Dimethyl-2-oxo-bicyclo[2.2.1]hept-1-yl)-ethanesulfonylamino]-3-(4-methanesulfonyl-piperazin-1-yl)-3-oxo-propyl]-benzamidine | CHEMBL319035
Type:
Small organic molecule
Emp. Form.:
C26H39N5O6S2
Mol. Mass.:
581.748
SMILES:
CC1(C)C2CCC1(CCS(=O)(=O)N[C@H](Cc1cccc(c1)C(N)=N)C(=O)N1CCN(CC1)S(C)(=O)=O)C(=O)C2
: