Target
Prothrombin
Ligand
BDBM50060025
Substrate
Meas. Tech.
ChEMBL_210595 (CHEMBL816562)
Ki
22±n/a nM
Citation
 Stürzebecher, JPrasa, DHauptmann, JVieweg, HWikström, P Synthesis and structure-activity relationships of potent thrombin inhibitors: piperazides of 3-amidinophenylalanine. J Med Chem 40:3091-9 (1997)  
Target
Name:
Prothrombin
Synonyms:
Activation peptide fragment 1 Coagulation factor II Prothrombin Thrombin Thrombin light chain
Type:
Enzyme
Mol. Mass.:
70502.73
Organism:
Bos taurus (Bovine)
Description:
P00735
Residue:
625
  
Inhibitor
Name:
BDBM50060025
Synonyms:
3-{2-(Naphthalene-2-sulfonylamino)-3-oxo-3-[4-(toluene-4-sulfonyl)-piperazin-1-yl]-propyl}-benzamidine | CHEMBL106718
Type:
Small organic molecule
Emp. Form.:
C31H33N5O5S2
Mol. Mass.:
619.754
SMILES:
Cc1ccc(cc1)S(=O)(=O)N1CCN(CC1)C(=O)C(Cc1cccc(c1)C(N)=N)NS(=O)(=O)c1ccc2ccccc2c1
: