Target
Mu-type opioid receptor
Ligand
BDBM50060071
Substrate
Meas. Tech.
ChEMBL_147101 (CHEMBL758266)
IC50
>10000±n/a nM
Citation
 Salvadori, SBalboni, GGuerrini, RTomatis, RBianchi, CBryant, SDCooper, PSLazarus, LH Evolution of the Dmt-Tic pharmacophore: N-terminal methylated derivatives with extraordinary delta opioid antagonist activity. J Med Chem 40:3100-8 (1997)  
Target
Name:
Mu-type opioid receptor
Synonyms:
M-OR-1 Mu opioid receptor OPIATE Mu OPRM_CAVPO
Type:
Enzyme Catalytic Domain
Mol. Mass.:
11165.58
Organism:
GUINEA PIG
Description:
P97266
Residue:
98
  
Inhibitor
Name:
BDBM50060071
Synonyms:
2-[(S)-3-(4-Hydroxy-2,6-dimethyl-phenyl)-2-methylamino-propionyl]-1,2,3,4-tetrahydro-isoquinoline-3-carboxylic acid | CHEMBL104842
Type:
Small organic molecule
Emp. Form.:
C22H26N2O4
Mol. Mass.:
382.4528
SMILES:
CN[C@@H](Cc1c(C)cc(O)cc1C)C(=O)N1Cc2ccccc2CC1C(O)=O
: