Target
Mu-type opioid receptor
Ligand
BDBM50060084
Substrate
Meas. Tech.
ChEMBL_148849 (CHEMBL756645)
Ki
19210±n/a nM
Citation
 Salvadori, SBalboni, GGuerrini, RTomatis, RBianchi, CBryant, SDCooper, PSLazarus, LH Evolution of the Dmt-Tic pharmacophore: N-terminal methylated derivatives with extraordinary delta opioid antagonist activity. J Med Chem 40:3100-8 (1997)  
Target
Name:
Mu-type opioid receptor
Synonyms:
MOR-1 Mu-type opioid receptor (MOR) OPRM_RAT Opioid receptor B Ror-b
Type:
G Protein-Coupled Receptor (GPCR)
Mol. Mass.:
44503.11
Organism:
Rattus norvegicus (rat)
Description:
Competition binding assays were carried out using membrane preparations from transfected HN9.10 cells that constitutively expressed the mu opioid receptor.
Residue:
398
  
Inhibitor
Name:
BDBM50060084
Synonyms:
2-({2-[(R)-3-(4-Hydroxy-2,6-dimethyl-phenyl)-2-methylamino-propionyl]-1,2,3,4-tetrahydro-isoquinoline-3-carbonyl}-amino)-propionic acid | CHEMBL2370387
Type:
Small organic molecule
Emp. Form.:
C25H31N3O5
Mol. Mass.:
453.5307
SMILES:
CN[C@H](Cc1c(C)cc(O)cc1C)C(=O)N1Cc2ccccc2C[C@H]1C(=O)N[C@@H](C)C(O)=O
: