Target
D(2) dopamine receptor
Ligand
BDBM50060600
Substrate
Meas. Tech.
ChEMBL_59631 (CHEMBL670823)
Ki
0.068000±n/a nM
Citation
 Baures, PWOjala, WHCostain, WJOtt, MCPradhan, AGleason, WBMishra, RKJohnson, RL Design, synthesis, and dopamine receptor modulating activity of diketopiperazine peptidomimetics of L-prolyl-L-leucylglycinamide. J Med Chem 40:3594-600 (1997)  
Target
Name:
D(2) dopamine receptor
Synonyms:
DOPAMINE D2 DRD2_BOVIN | Dopamine D2 receptor
Type:
Enzyme Catalytic Domain
Mol. Mass.:
50698.79
Organism:
BOVINE
Description:
P20288
Residue:
444
  
Inhibitor
Name:
BDBM50060600
Synonyms:
(S)-2-((S)-1,4-Dioxo-hexahydro-pyrrolo[1,2-a]pyrazin-2-yl)-4-methyl-pentanoic acid carbamoylmethyl-amide | CHEMBL332740
Type:
Small organic molecule
Emp. Form.:
C15H24N4O4
Mol. Mass.:
324.3755
SMILES:
CC(C)C[C@H](N1CC(=O)N2CCC[C@H]2C1=O)C(=O)NCC(N)=O
: