Target
Glutamate receptor 2
Ligand
BDBM50060627
Substrate
Meas. Tech.
ChEMBL_90152 (CHEMBL696974)
Ki
176±n/a nM
Citation
 Jane, DEHoo, KKamboj, RDeverill, MBleakman, DMandelzys, A Synthesis of willardiine and 6-azawillardiine analogs: pharmacological characterization on cloned homomeric human AMPA and kainate receptor subtypes. J Med Chem 40:3645-50 (1997)  
Target
Name:
Glutamate receptor 2
Synonyms:
AMPA-selective glutamate receptor 2 GRIA2 GluR-2 GluR-K2 Glutamate receptor 2 Glutamate receptor AMPA 2/3 Glutamate receptor ionotropic, AMPA 2
Type:
Enzyme Catalytic Domain
Mol. Mass.:
98825.96
Organism:
Homo sapiens (Human)
Description:
Glutamate AMPA 2 GRIA2 HUMAN::P42262
Residue:
883
  
Inhibitor
Name:
BDBM50060627
Synonyms:
(S)-2-Amino-3-(5-iodo-2,4-dioxo-3,4-dihydro-2H-pyrimidin-1-yl)-propionic acid 2-AMINO-3-(5-IODO-2,4-DIOXO-3,4-DIHYDRO-2H-PYRIMIDIN-1-YL)-PROPIONIC ACID | CHEMBL121915
Type:
Small organic molecule
Emp. Form.:
C7H8IN3O4
Mol. Mass.:
325.0606
SMILES:
N[C@@H](Cn1cc(I)c(=O)[nH]c1=O)C(O)=O
: