Target
Glutamate receptor 1
Ligand
BDBM50060636
Substrate
Meas. Tech.
ChEMBL_90141 (CHEMBL878883)
Ki
92±n/a nM
Citation
 Jane, DEHoo, KKamboj, RDeverill, MBleakman, DMandelzys, A Synthesis of willardiine and 6-azawillardiine analogs: pharmacological characterization on cloned homomeric human AMPA and kainate receptor subtypes. J Med Chem 40:3645-50 (1997)  
Target
Name:
Glutamate receptor 1
Synonyms:
AMPA-selective glutamate receptor 1 GLUR1 GRIA1_HUMAN GluR-A Glutamate AMPA 1 Glutamate receptor AMPA 1/2 Glutamate receptor ionotropic, AMPA 1
Type:
Enzyme Catalytic Domain
Mol. Mass.:
101512.92
Organism:
Homo sapiens (Human)
Description:
Glutamate AMPA 1 GRIA1 HUMAN::P42261
Residue:
906
  
Inhibitor
Name:
BDBM50060636
Synonyms:
(S)-2-Amino-3-(5-bromo-2,4-dioxo-3,4-dihydro-2H-pyrimidin-1-yl)-propionic acid 2-AMINO-3-(5-BROMO-2,4-DIOXO-3,4-DIHYDRO-2H-PYRIMIDIN-1-YL)-PROPIONIC ACID | CHEMBL333964
Type:
Small organic molecule
Emp. Form.:
C7H8BrN3O4
Mol. Mass.:
278.06
SMILES:
N[C@@H](Cn1cc(Br)c(=O)[nH]c1=O)C(O)=O
: