Target
5-hydroxytryptamine receptor 1B
Ligand
BDBM50060679
Substrate
Meas. Tech.
ChEMBL_1780 (CHEMBL616754)
IC50
167±n/a nM
Citation
 Campiani, GCappelli, ANacci, VAnzini, MVomero, SHamon, MCagnotto, AFracasso, CUboldi, CCaccia, SConsolo, SMennini, T Novel and highly potent 5-HT3 receptor agonists based on a pyrroloquinoxaline structure. J Med Chem 40:3670-8 (1997)  
Target
Name:
5-hydroxytryptamine receptor 1B
Synonyms:
5-HT-1B 5-hydroxytryptamine receptor 1B (5HT1B) 5ht1b Serotonin 1 (5-HT1) receptor Serotonin receptor 1B
Type:
Protein
Mol. Mass.:
43173.33
Organism:
Rattus norvegicus (Rat)
Description:
P28564
Residue:
386
  
Inhibitor
Name:
BDBM50060679
Synonyms:
7-Fluoro-4-piperazin-1-yl-pyrrolo[1,2-a]quinoxaline | CHEMBL120216
Type:
Small organic molecule
Emp. Form.:
C15H15FN4
Mol. Mass.:
270.3048
SMILES:
Fc1ccc2c(c1)nc(N1CCNCC1)c1cccn21
: