Target
5-hydroxytryptamine receptor 2A
Ligand
BDBM50060686
Substrate
Meas. Tech.
ChEMBL_2590 (CHEMBL617458)
IC50
43±n/a nM
Citation
 Campiani, GCappelli, ANacci, VAnzini, MVomero, SHamon, MCagnotto, AFracasso, CUboldi, CCaccia, SConsolo, SMennini, T Novel and highly potent 5-HT3 receptor agonists based on a pyrroloquinoxaline structure. J Med Chem 40:3670-8 (1997)  
Target
Name:
5-hydroxytryptamine receptor 2A
Synonyms:
5-HT-2A 5-HT2A 5-hydroxytryptamine receptor 2A (5HT2A) Htr2 Serotonin Receptor 2A
Type:
G Protein-Coupled Receptor (GPCR)
Mol. Mass.:
52852.05
Organism:
Rattus norvegicus (rat)
Description:
Rat cortex membranes 5-HT2A receptors.
Residue:
471
  
Inhibitor
Name:
BDBM50060686
Synonyms:
4-(4-Methyl-piperazin-1-yl)-pyrrolo[1,2-a]quinoline CHEMBL327197
Type:
Small organic molecule
Emp. Form.:
C16H18N4
Mol. Mass.:
266.3409
SMILES:
CN1CCN(CC1)c1nc2ccccc2n2cccc12
: