Target
Cholecystokinin receptor type A
Ligand
BDBM50369326
Substrate
Meas. Tech.
ChEMBL_47645 (CHEMBL659916)
Ki
0.24±n/a nM
Citation
 Pierson, MEComstock, JMSimmons, RDKaiser, FJulien, RZongrone, JRosamond, JD Synthesis and biological evaluation of potent, selective, hexapeptide CCK-A agonist anorectic agents. J Med Chem 40:4302-7 (1998)  
Target
Name:
Cholecystokinin receptor type A
Synonyms:
CCKAR_RAT Cholecystokinin peripheral Cholecystokinin receptor type A
Type:
Enzyme Catalytic Domain
Mol. Mass.:
49676.37
Organism:
RAT
Description:
Cholecystokinin central 0 RAT::P30551
Residue:
444
  
Inhibitor
Name:
BDBM50369326
Synonyms:
CHEMBL1791002
Type:
Small organic molecule
Emp. Form.:
C47H60N8O13S
Mol. Mass.:
977.09
SMILES:
CC[C@H](C)[C@H](NC(=O)Cc1ccc(OS(O)(=O)=O)cc1)C(=O)NCC(=O)N[C@@H](Cc1c[nH]c2ccccc12)C(=O)N[C@@H]([C@@H](C)CC)C(=O)N(C)[C@@H](CC(O)=O)C(=O)N[C@@H](Cc1ccccc1)C(N)=O
: