Target
Kappa-type opioid receptor
Ligand
BDBM50056629
Substrate
Meas. Tech.
ChEMBL_146524 (CHEMBL753836)
Ki
190±n/a nM
Citation
 Palmer, RBUpthagrove, ALNelson, WL (E)- and (Z)-7-arylidenenaltrexones: synthesis and opioid receptor radioligand displacement assays. J Med Chem 40:749-53 (1997)  
Target
Name:
Kappa-type opioid receptor
Synonyms:
Kappa Opioid Receptor OPRK1 Opiate Kappa 1 | mu/kappa opioid receptor
Type:
G Protein-Coupled Receptor (GPCR)
Mol. Mass.:
42744.99
Organism:
Cavia porcellus (domestic guinea pig)
Description:
P41144
Residue:
380
  
Inhibitor
Name:
BDBM50056629
Synonyms:
4-cyclopropylmethyl-10,17-dihydroxy-15-[1-(4-phenylphenyl)-(E)-methylidene]-(5R,13R,17S)-12-oxa-4-azapentacyclo[9.6.1.01,13.05,17.07,18]octadeca-7(18),8,10-trien-14-one CHEMBL355188
Type:
Small organic molecule
Emp. Form.:
C33H31NO4
Mol. Mass.:
505.6035
SMILES:
Oc1ccc2C[C@H]3N(CC4CC4)CCC45[C@@H](Oc1c24)C(=O)C(C[C@@]35O)=Cc1ccc(cc1)-c1ccccc1
: