Target
3-oxo-5-alpha-steroid 4-dehydrogenase 1
Ligand
BDBM50057499
Substrate
Meas. Tech.
ChEMBL_205217 (CHEMBL816491)
IC50
17±n/a nM
Citation
 Kenny, BBallard, SBlagg, JFox, D Pharmacological options in the treatment of benign prostatic hyperplasia. J Med Chem 40:1293-315 (1997)  
Target
Name:
3-oxo-5-alpha-steroid 4-dehydrogenase 1
Synonyms:
3-oxo-5-alpha-steroid 4-dehydrogenase 1 S5A1_HUMAN SR type 1 Steroid 5-alpha-reductase | Steroid 5-alpha-reductase 1
Type:
Enzyme
Mol. Mass.:
29472.80
Organism:
Homo sapiens (Human)
Description:
P18405
Residue:
259
  
Inhibitor
Name:
BDBM50057499
Synonyms:
(R)-8-Chloro-4,10b-dimethyl-1,4,4a,5,6,10b-hexahydro-2H-benzo[f]quinolin-3-one | CHEMBL417109
Type:
Small organic molecule
Emp. Form.:
C15H18ClNO
Mol. Mass.:
263.763
SMILES:
CN1C2CCc3cc(Cl)ccc3[C@@]2(C)CCC1=O
: