Target
Adenosine receptor A2a
Ligand
BDBM50454904
Substrate
Meas. Tech.
ChEMBL_29987 (CHEMBL881273)
Ki
18800±n/a nM
Citation
 van der Wenden, EMCarnielli, MRoelen, HCLorenzen, Avon Frijtag Drabbe Künzel, JKIJzerman, AP 5'-substituted adenosine analogs as new high-affinity partial agonists for the adenosine A1 receptor. J Med Chem 41:102-8 (1998)  
Target
Name:
Adenosine receptor A2a
Synonyms:
AA2AR_RAT Adenosine A2 receptor Adenosine Receptors A2a (A2a) Adenosine receptors A2a Rat striatal adenosine A2a receptor
Type:
G Protein-Coupled Receptor (GPCR)
Mol. Mass.:
45015.65
Organism:
Rattus norvegicus (rat)
Description:
Rat A2A receptors expressed in CHO cells.
Residue:
410
  
Inhibitor
Name:
BDBM50454904
Synonyms:
CHEMBL2113467
Type:
Small organic molecule
Emp. Form.:
C18H27N5O3S
Mol. Mass.:
393.504
SMILES:
CCCSC[C@H]1O[C@H]([C@H](O)[C@@H]1O)n1cnc2c(NC3CCCC3)ncnc12
: