Target
Metabotropic glutamate receptor 4
Ligand
BDBM50064246
Substrate
Meas. Tech.
ChEMBL_106709 (CHEMBL714010)
EC50
1000000±n/a nM
Citation
 Kozikowski, APSteensma, DAraldi, GLTückmantel, WWang, SPshenichkin, SSurina, EWroblewski, JT Synthesis and biology of the conformationally restricted ACPD analogue, 2-aminobicyclo[2.1.1]hexane-2,5-dicarboxylic acid-I, a potent mGluR agonist. J Med Chem 41:1641-50 (1998)  
Target
Name:
Metabotropic glutamate receptor 4
Synonyms:
GPRC1D GRM4_HUMAN MGLUR4 Metabotropic glutamate receptor 4 (mGlu4) metabotropic glutamate 4
Type:
Protein
Mol. Mass.:
101899.95
Organism:
Homo sapiens (Human)
Description:
Q14833
Residue:
912
  
Inhibitor
Name:
BDBM50064246
Synonyms:
(1R,2S,4R,5R)-2-Amino-bicyclo[2.1.1]hexane-2,5-dicarboxylic acid | CHEMBL46527
Type:
Small organic molecule
Emp. Form.:
C8H11NO4
Mol. Mass.:
185.1772
SMILES:
N[C@]1(C[C@H]2C[C@@H]1[C@@H]2C(O)=O)C(O)=O
: