Target
Metabotropic glutamate receptor 2
Ligand
BDBM50064247
Substrate
Meas. Tech.
ChEMBL_106230 (CHEMBL878220)
EC50
38000±n/a nM
Citation
 Kozikowski, APSteensma, DAraldi, GLTückmantel, WWang, SPshenichkin, SSurina, EWroblewski, JT Synthesis and biology of the conformationally restricted ACPD analogue, 2-aminobicyclo[2.1.1]hexane-2,5-dicarboxylic acid-I, a potent mGluR agonist. J Med Chem 41:1641-50 (1998)  
Target
Name:
Metabotropic glutamate receptor 2
Synonyms:
GPRC1B GRM2_HUMAN Metabotropic glutamate receptor mGlu2 | metabotropic glutamate 2
Type:
Enzyme
Mol. Mass.:
95584.88
Organism:
Homo sapiens (Human)
Description:
Q14416
Residue:
872
  
Inhibitor
Name:
BDBM50064247
Synonyms:
(1S,2S,4S,5R)-2-Amino-bicyclo[2.1.1]hexane-2,5-dicarboxylic acid | CHEMBL42148
Type:
Small organic molecule
Emp. Form.:
C8H11NO4
Mol. Mass.:
185.1772
SMILES:
N[C@]1(C[C@@H]2C[C@H]1[C@@H]2C(O)=O)C(O)=O
: