Target
Metabotropic glutamate receptor 1
Ligand
BDBM50064246
Substrate
Meas. Tech.
ChEMBL_105876 (CHEMBL717927)
EC50
121000±n/a nM
Citation
 Kozikowski, APSteensma, DAraldi, GLTückmantel, WWang, SPshenichkin, SSurina, EWroblewski, JT Synthesis and biology of the conformationally restricted ACPD analogue, 2-aminobicyclo[2.1.1]hexane-2,5-dicarboxylic acid-I, a potent mGluR agonist. J Med Chem 41:1641-50 (1998)  
Target
Name:
Metabotropic glutamate receptor 1
Synonyms:
GPRC1A GRM1_HUMAN Metabotropic Glutamate 1a | metabotropic glutamate 1
Type:
Enzyme
Mol. Mass.:
132358.19
Organism:
Homo sapiens (Human)
Description:
Q13255
Residue:
1194
  
Inhibitor
Name:
BDBM50064246
Synonyms:
(1R,2S,4R,5R)-2-Amino-bicyclo[2.1.1]hexane-2,5-dicarboxylic acid | CHEMBL46527
Type:
Small organic molecule
Emp. Form.:
C8H11NO4
Mol. Mass.:
185.1772
SMILES:
N[C@]1(C[C@H]2C[C@@H]1[C@@H]2C(O)=O)C(O)=O
: