Target
Muscarinic acetylcholine receptor M4
Ligand
BDBM50064609
Substrate
Meas. Tech.
ChEMBL_139124 (CHEMBL749862)
Ki
33±n/a nM
Citation
 Pei, XFGupta, THBadio, BPadgett, WLDaly, JW 6beta-Acetoxynortropane: a potent muscarinic agonist with apparent selectivity toward M2-receptors. J Med Chem 41:2047-55 (1998)  
Target
Name:
Muscarinic acetylcholine receptor M4
Synonyms:
ACM4_HUMAN Cholinergic, muscarinic M4 Muscarinic acetylcholine receptor M2 and M4
Type:
Enzyme Catalytic Domain
Mol. Mass.:
53079.31
Organism:
Homo sapiens (Human)
Description:
Cholinergic, muscarinic M4 CHRM4 HUMAN M3::P08173
Residue:
479
  
Inhibitor
Name:
BDBM50064609
Synonyms:
6-acetoxy-8-azonia-bicyclo[3.2.1]octane CHEMBL64000
Type:
Small organic molecule
Emp. Form.:
C9H15NO2
Mol. Mass.:
169.2209
SMILES:
CC(=O)OC1CC2CCCC1N2
: