Target
Lysosomal alpha-glucosidase
Ligand
BDBM50065252
Substrate
Meas. Tech.
ChEMBL_34421 (CHEMBL649425)
IC50
20±n/a nM
Citation
 Asano, NNishida, MKato, AKizu, HMatsui, KShimada, YItoh, TBaba, MWatson, AANash, RJLilley, PMWatkin, DJFleet, GW Homonojirimycin isomers and N-alkylated homonojirimycins: structural and conformational basis of inhibition of glycosidases. J Med Chem 41:2565-71 (1998)  
Target
Name:
Lysosomal alpha-glucosidase
Synonyms:
Acidic alpha-glucosidase LYAG_RAT
Type:
PROTEIN
Mol. Mass.:
106191.24
Organism:
Rattus norvegicus
Description:
ChEMBL_1506157
Residue:
953
  
Inhibitor
Name:
BDBM50065252
Synonyms:
2,6-Bis-hydroxymethyl-1-methyl-piperidine-3,4,5-triol | CHEMBL2442258
Type:
Small organic molecule
Emp. Form.:
C8H17NO5
Mol. Mass.:
207.2243
SMILES:
CN1[C@H](CO)[C@@H](O)[C@H](O)[C@@H](O)[C@H]1CO
: