Target
Nitric oxide synthase, brain
Ligand
BDBM50065843
Substrate
Meas. Tech.
ChEMBL_143377 (CHEMBL752276)
Ki
8.7±n/a nM
Citation
 Collins, JLShearer, BGOplinger, JALee, SGarvey, EPSalter, MDuffy, CBurnette, TCFurfine, ES N-Phenylamidines as selective inhibitors of human neuronal nitric oxide synthase: structure-activity studies and demonstration of in vivo activity. J Med Chem 41:2858-71 (1998)  
Target
Name:
Nitric oxide synthase, brain
Synonyms:
Constitutive NOS NC-NOS NOS type I nNOS NOS1_HUMAN Neuronal nitric oxide synthase Nitric oxide synthase, neuronal (nNOS) bNOS | nNOS
Type:
Homodimer
Mol. Mass.:
160985.98
Organism:
Homo sapiens (Human)
Description:
P29475
Residue:
1434
  
Inhibitor
Name:
BDBM50065843
Synonyms:
CHEMBL553081 N-(3-Aminomethyl-phenyl)-thiophene-2-carboxamidine
Type:
Small organic molecule
Emp. Form.:
C12H13N3S
Mol. Mass.:
231.317
SMILES:
NCc1cccc(c1)N=C(N)c1cccs1
: