Target
Nitric oxide synthase, endothelial
Ligand
BDBM50065844
Substrate
Meas. Tech.
ChEMBL_65318 (CHEMBL678091)
Ki
8000±n/a nM
Citation
 Collins, JLShearer, BGOplinger, JALee, SGarvey, EPSalter, MDuffy, CBurnette, TCFurfine, ES N-Phenylamidines as selective inhibitors of human neuronal nitric oxide synthase: structure-activity studies and demonstration of in vivo activity. J Med Chem 41:2858-71 (1998)  
Target
Name:
Nitric oxide synthase, endothelial
Synonyms:
Constitutive NOS Endothelial NOS NOS type III NOS3_HUMAN Nitric oxide synthase (inducible and endothelial) Nitric-oxide synthase (endothelial and brain) eNOS
Type:
Enzyme Catalytic Domain
Mol. Mass.:
133297.84
Organism:
Homo sapiens (Human)
Description:
P29474
Residue:
1203
  
Inhibitor
Name:
BDBM50065844
Synonyms:
CHEMBL542674 | N-(4-Sulfamoyl-phenyl)-acetamidine; hydrobromide
Type:
Small organic molecule
Emp. Form.:
C8H11N3O2S
Mol. Mass.:
213.257
SMILES:
CC(N)=Nc1ccc(cc1)S(N)(=O)=O
: