Target
Nitric oxide synthase, endothelial
Ligand
BDBM50065848
Substrate
Meas. Tech.
ChEMBL_65318 (CHEMBL678091)
Ki
1900±n/a nM
Citation
 Collins, JLShearer, BGOplinger, JALee, SGarvey, EPSalter, MDuffy, CBurnette, TCFurfine, ES N-Phenylamidines as selective inhibitors of human neuronal nitric oxide synthase: structure-activity studies and demonstration of in vivo activity. J Med Chem 41:2858-71 (1998)  
Target
Name:
Nitric oxide synthase, endothelial
Synonyms:
Constitutive NOS Endothelial NOS NOS type III NOS3_HUMAN Nitric oxide synthase (inducible and endothelial) Nitric-oxide synthase (endothelial and brain) eNOS
Type:
Enzyme Catalytic Domain
Mol. Mass.:
133297.84
Organism:
Homo sapiens (Human)
Description:
P29474
Residue:
1203
  
Inhibitor
Name:
BDBM50065848
Synonyms:
CHEMBL539793 | N-(4-Methylaminomethyl-phenyl)-acetamidine
Type:
Small organic molecule
Emp. Form.:
C10H15N3
Mol. Mass.:
177.2462
SMILES:
CNCc1ccc(cc1)N=C(C)N
: