Target
Adenosine receptor A3
Ligand
BDBM50179032
Substrate
Meas. Tech.
ChEMBL_30469 (CHEMBL643130)
Ki
696±n/a nM
Citation
 Baraldi, PGCacciari, BPineda de Las Infantas, MJRomagnoli, RSpalluto, GVolpini, RCostanzi, SVittori, SCristalli, GMelman, NPark, KSJi, XDJacobson, KA Synthesis and biological activity of a new series of N6-arylcarbamoyl, 2-(Ar)alkynyl-N6-arylcarbamoyl, and N6-carboxamido derivatives of adenosine-5'-N-ethyluronamide as A1 and A3 adenosine receptor agonists. J Med Chem 41:3174-85 (1998)  
Target
Name:
Adenosine receptor A3
Synonyms:
AA3R_RAT Adenosine receptor A2a and A3 | Adora3
Type:
PROTEIN
Mol. Mass.:
36643.73
Organism:
Rattus norvegicus
Description:
ChEMBL_479910
Residue:
320
  
Inhibitor
Name:
BDBM50179032
Synonyms:
1-(3-chlorophenyl)-3-(9-((2R,3R,4S,5S)-5-(ethylcarbamoyl)-3,4-dihydroxy-tetrahydrofuran-2-yl)-2-(3-hydroxy-3-phenylprop-1-ynyl)-9H-purin-6-yl)urea | CHEMBL206116
Type:
Small organic molecule
Emp. Form.:
C28H26ClN7O6
Mol. Mass.:
592.002
SMILES:
CCNC(=O)[C@H]1O[C@H]([C@H](O)[C@@H]1O)n1cnc2c(NC(=O)Nc3cccc(Cl)c3)nc(nc12)C#CC(O)c1ccccc1
: