Target
Adenosine receptor A2a
Ligand
BDBM50179022
Substrate
Meas. Tech.
ChEMBL_29993 (CHEMBL642181)
Ki
59±n/a nM
Citation
 Baraldi, PGCacciari, BPineda de Las Infantas, MJRomagnoli, RSpalluto, GVolpini, RCostanzi, SVittori, SCristalli, GMelman, NPark, KSJi, XDJacobson, KA Synthesis and biological activity of a new series of N6-arylcarbamoyl, 2-(Ar)alkynyl-N6-arylcarbamoyl, and N6-carboxamido derivatives of adenosine-5'-N-ethyluronamide as A1 and A3 adenosine receptor agonists. J Med Chem 41:3174-85 (1998)  
Target
Name:
Adenosine receptor A2a
Synonyms:
AA2AR_RAT Adenosine A2 receptor Adenosine Receptors A2a (A2a) Adenosine receptors A2a Rat striatal adenosine A2a receptor
Type:
G Protein-Coupled Receptor (GPCR)
Mol. Mass.:
45015.65
Organism:
Rattus norvegicus (rat)
Description:
Rat A2A receptors expressed in CHO cells.
Residue:
410
  
Inhibitor
Name:
BDBM50179022
Synonyms:
1-(2-chloro-9-((2R,3R,4S,5S)-5-(ethylcarbamoyl)-3,4-dihydroxy-tetrahydrofuran-2-yl)-9H-purin-6-yl)-3-(4-methoxyphenyl)urea | CHEMBL204820
Type:
Small organic molecule
Emp. Form.:
C20H22ClN7O6
Mol. Mass.:
491.885
SMILES:
CCNC(=O)[C@H]1O[C@H]([C@H](O)[C@@H]1O)n1cnc2c(NC(=O)Nc3ccc(OC)cc3)nc(Cl)nc12
: