Target
Adenosine receptor A1
Ligand
BDBM50179036
Substrate
Meas. Tech.
ChEMBL_29153 (CHEMBL639433)
Ki
75±n/a nM
Citation
 Baraldi, PGCacciari, BPineda de Las Infantas, MJRomagnoli, RSpalluto, GVolpini, RCostanzi, SVittori, SCristalli, GMelman, NPark, KSJi, XDJacobson, KA Synthesis and biological activity of a new series of N6-arylcarbamoyl, 2-(Ar)alkynyl-N6-arylcarbamoyl, and N6-carboxamido derivatives of adenosine-5'-N-ethyluronamide as A1 and A3 adenosine receptor agonists. J Med Chem 41:3174-85 (1998)  
Target
Name:
Adenosine receptor A1
Synonyms:
AA1R_RAT ADENOSINE A1 high Adenosine A1 receptor (A1) Adenosine receptors A1 | Adora1
Type:
Protein
Mol. Mass.:
36704.13
Organism:
Rattus norvegicus (rat)
Description:
Residue:
326
  
Inhibitor
Name:
BDBM50179036
Synonyms:
1-(9-((2R,3R,4S,5S)-5-(ethylcarbamoyl)-3,4-dihydroxy-tetrahydrofuran-2-yl)-2-(3-hydroxy-3-phenylprop-1-ynyl)-9H-purin-6-yl)-3-(4-methoxyphenyl)urea | CHEMBL203960
Type:
Small organic molecule
Emp. Form.:
C29H29N7O7
Mol. Mass.:
587.5833
SMILES:
CCNC(=O)[C@H]1O[C@H]([C@H](O)[C@@H]1O)n1cnc2c(NC(=O)Nc3ccc(OC)cc3)nc(nc12)C#CC(O)c1ccccc1
: